{"text_format":"1","workbook":"xlsx","n_sheets":3,"sheets":["cadets juniors garcons","cadette juniors filles ","Minimas"],"not_rendered":{"charts":0,"images":1,"macros":0,"external_links":0,"defined_names":2,"comments":0,"pivot_tables":0},"unopened":[],"bounds":{"document_bytes":16777216,"sheet_cells":100000,"rows_first":2000,"rows_last":500,"rows_between":2000,"halvings":0,"cell_chars":16384,"cell_head_chars":4096},"cells_cut":0,"cells_raw":0,"read":"whole","date_system":"1900"}

{"sheet":"cadets juniors garcons","index":0,"n_rows":38,"n_cols":40,"rows_kept":38,"cut":false,"hidden":false,"merged":[[1,3,2,8],[1,10,2,11],[1,13,1,18],[1,21,1,22],[2,13,2,18],[2,21,2,22],[4,5,4,6],[6,1,8,1],[6,3,8,3],[7,8,8,8],[10,1,12,1],[10,3,12,3],[11,8,12,8],[14,1,16,1],[14,3,16,3],[15,8,16,8],[18,1,20,1],[18,3,20,3],[19,8,20,8],[36,16,36,19],[22,1,24,1],[22,3,24,3],[23,8,24,8],[26,1,28,1],[26,3,28,3],[27,8,28,8],[36,20,36,22],[37,16,37,19],[37,20,37,22],[30,1,37,11],[30,16,30,19],[30,20,30,22],[31,16,31,19],[31,20,31,22],[32,16,32,19],[32,20,32,22],[33,16,33,19],[33,20,33,22],[34,16,34,19],[34,20,34,22],[35,16,35,19],[35,20,35,22]]}
[]
[null,null,null,"COUPE DE FRANCE U15 - U17 - U20 - H&F",null,null,null,null,null,null,"1er \nTour",null,null,"LIEU",null,null,null,null,null,null,null,"DATE"]
[null,null,null,"ELIMINATOIRES DE LIGUE GPF / FRANCE ",null,null,null,null,null,null,null,null,null,"TOULON",null,null,null,null,null,null,null,"2019-01-16"]
[]
[null,"REG","Licence","Pl","Genre","NOM - Prénom",null,"AN","CLUB","NAT","P.C.",1,2,3,"ARR",1,2,3,"EP-J","TOTAL","Serie","Catégorie","IWF",null,null,null,null,"DEB","DPT +","REG +","IRG +","FED +","NAT +","INTB +","INTA +","OLY +"]
[null,null,null,null,null,null,null,null,null,null,null,null,null,null,null,null,null,null,null,null,null,null,null,null,null,null,null,"DEB ","DEP +","REG +","IRG +","FED +","NAT +","INTB +","INTA +","OLY +"]
[null,"SUD PACA",448831,1,"H","REY","Dorian",2005,null,"F",53.2,43,45,48,{"$f":"IF(E7=\"\",\"\",IF(MAXA(L7:N7)<=0,0,MAXA(L7:N7)))","v":48},55,-58,58,{"$f":"IF(E7=\"\",\"\",IF(MAXA(P7:R7)<=0,0,MAXA(P7:R7)))","v":58},{"$f":"IF(E7=\"\",\"\",O7+S7)","v":106},{"$f":"+CONCATENATE(AM7,\" \",AN7)","v":"IRG + 6"},{"$f":"IF(E7=0,\" \",IF(E7=\"H\",IF(H7<1999,VLOOKUP(K7,Minimas!$A$15:$F$29,6),IF(AND(H7>1998,H7<2002),VLOOKUP(K7,Minimas!$A$15:$F$29,5),IF(AND(H7>2001,H7<2004),VLOOKUP(K7,Minimas!$A$15:$F$29,4),IF(AND(H7>2003,H7<2006),VLOOKUP(K7,Minimas!$A$15:$F$29,3),VLOOKUP(K7,Minimas!$A$15:$F$29,2))))),IF(H7<1999,VLOOKUP(K7,Minimas!$G$15:$L$29,6),IF(AND(H7>1998,H7<2002),VLOOKUP(K7,Minimas!$G$15:$L$29,5),IF(AND(H7>2001,H7<2004),VLOOKUP(K7,Minimas!$G$15:$L$29,4),IF(AND(H7>2003,H7<2006),VLOOKUP(K7,Minimas!$G$15:$L$29,3),VLOOKUP(K7,Minimas!$G$15:$L$29,2)))))))","v":"U15 M55"},{"$f":"IF(E7=\" \",\" \",IF(E7=\"H\",10^(0.75194503*LOG(K7/175.508)^2)*T7,IF(E7=\"F\",10^(0.783497476* LOG(K7/153.655)^2)*T7,\"\")))","v":168.79944637258845},null,null,null,null,{"$f":"T7-HLOOKUP(V7,Minimas!$C$3:$CD$12,2,FALSE)","v":51},{"$f":"T7-HLOOKUP(V7,Minimas!$C$3:$CD$12,3,FALSE)","v":36},{"$f":"T7-HLOOKUP(V7,Minimas!$C$3:$CD$12,4,FALSE)","v":21},{"$f":"T7-HLOOKUP(V7,Minimas!$C$3:$CD$12,5,FALSE)","v":6},{"$f":"T7-HLOOKUP(V7,Minimas!$C$3:$CD$12,6,FALSE)","v":-9},{"$f":"T7-HLOOKUP(V7,Minimas!$C$3:$CD$12,7,FALSE)","v":-24},{"$f":"T7-HLOOKUP(V7,Minimas!$C$3:$CD$12,8,FALSE)","v":-44},{"$f":"T7-HLOOKUP(V7,Minimas!$C$3:$CD$12,9,FALSE)","v":-64},{"$f":"T7-HLOOKUP(V7,Minimas!$C$3:$CD$12,10,FALSE)","v":-169},{"$f":"IF(E7=0,\" \",IF(AJ7>=0,$AJ$5,IF(AI7>=0,$AI$5,IF(AH7>=0,$AH$5,IF(AG7>=0,$AG$5,IF(AF7>=0,$AF$5,IF(AE7>=0,$AE$5,IF(AD7>=0,$AD$5,IF(AC7>=0,$AC$5,$AB$5)))))))))","v":"IRG +"},null,{"$f":"IF(AK7=\"\",\"\",AK7)","v":"IRG +"},{"$f":"IF(E7=0,\" \",IF(AJ7>=0,AJ7,IF(AI7>=0,AI7,IF(AH7>=0,AH7,IF(AG7>=0,AG7,IF(AF7>=0,AF7,IF(AE7>=0,AE7,IF(AD7>=0,AD7,IF(AC7>=0,AC7,AB7)))))))))","v":6}]
[null,null,443407,null,"H","NGA NGA","Franck",2002,{"$f":"SUM(W7:W9)","v":500.57620371221714},"F",112,65,70,-73,{"$f":"IF(E8=\"\",\"\",IF(MAXA(L8:N8)<=0,0,MAXA(L8:N8)))","v":70},85,-88,90,{"$f":"IF(E8=\"\",\"\",IF(MAXA(P8:R8)<=0,0,MAXA(P8:R8)))","v":90},{"$f":"IF(E8=\"\",\"\",O8+S8)","v":160},"DPT + 10",{"$f":"IF(E8=0,\" \",IF(E8=\"H\",IF(H8<1999,VLOOKUP(K8,Minimas!$A$15:$F$29,6),IF(AND(H8>1998,H8<2002),VLOOKUP(K8,Minimas!$A$15:$F$29,5),IF(AND(H8>2001,H8<2004),VLOOKUP(K8,Minimas!$A$15:$F$29,4),IF(AND(H8>2003,H8<2006),VLOOKUP(K8,Minimas!$A$15:$F$29,3),VLOOKUP(K8,Minimas!$A$15:$F$29,2))))),IF(H8<1999,VLOOKUP(K8,Minimas!$G$15:$L$29,6),IF(AND(H8>1998,H8<2002),VLOOKUP(K8,Minimas!$G$15:$L$29,5),IF(AND(H8>2001,H8<2004),VLOOKUP(K8,Minimas!$G$15:$L$29,4),IF(AND(H8>2003,H8<2006),VLOOKUP(K8,Minimas!$G$15:$L$29,3),VLOOKUP(K8,Minimas!$G$15:$L$29,2)))))))","v":"U17 M>102"},{"$f":"IF(E8=\" \",\" \",IF(E8=\"H\",10^(0.75194503*LOG(K8/175.508)^2)*T8,IF(E8=\"F\",10^(0.783497476* LOG(K8/153.655)^2)*T8,\"\")))","v":170.8975487902606},null,null,null,null,{"$f":"T8-HLOOKUP(V8,Minimas!$C$3:$CD$12,2,FALSE)","v":30},{"$f":"T8-HLOOKUP(V8,Minimas!$C$3:$CD$12,3,FALSE)","v":10},{"$f":"T8-HLOOKUP(V8,Minimas!$C$3:$CD$12,4,FALSE)","v":-15},{"$f":"T8-HLOOKUP(V8,Minimas!$C$3:$CD$12,5,FALSE)","v":-35},{"$f":"T8-HLOOKUP(V8,Minimas!$C$3:$CD$12,6,FALSE)","v":-55},{"$f":"T8-HLOOKUP(V8,Minimas!$C$3:$CD$12,7,FALSE)","v":-75},{"$f":"T8-HLOOKUP(V8,Minimas!$C$3:$CD$12,8,FALSE)","v":-100},{"$f":"T8-HLOOKUP(V8,Minimas!$C$3:$CD$12,9,FALSE)","v":-130},{"$f":"T8-HLOOKUP(V8,Minimas!$C$3:$CD$12,10,FALSE)","v":-220},{"$f":"IF(E8=0,\" \",IF(AJ8>=0,$AJ$5,IF(AI8>=0,$AI$5,IF(AH8>=0,$AH$5,IF(AG8>=0,$AG$5,IF(AF8>=0,$AF$5,IF(AE8>=0,$AE$5,IF(AD8>=0,$AD$5,IF(AC8>=0,$AC$5,$AB$5)))))))))","v":"DPT +"},null,{"$f":"IF(AK8=\"\",\"\",AK8)","v":"DPT +"},{"$f":"IF(E8=0,\" \",IF(AJ8>=0,AJ8,IF(AI8>=0,AI8,IF(AH8>=0,AH8,IF(AG8>=0,AG8,IF(AF8>=0,AF8,IF(AE8>=0,AE8,IF(AD8>=0,AD8,IF(AC8>=0,AC8,AB8)))))))))","v":10}]
[null,null,447395,null,"H","MUSQUIN","Nolan",2003,null,"F",91.4,63,67,70,70,-70,-70,70,70,140,"DPT + 0",{"$f":"IF(E9=0,\" \",IF(E9=\"H\",IF(H9<1999,VLOOKUP(K9,Minimas!$A$15:$F$29,6),IF(AND(H9>1998,H9<2002),VLOOKUP(K9,Minimas!$A$15:$F$29,5),IF(AND(H9>2001,H9<2004),VLOOKUP(K9,Minimas!$A$15:$F$29,4),IF(AND(H9>2003,H9<2006),VLOOKUP(K9,Minimas!$A$15:$F$29,3),VLOOKUP(K9,Minimas!$A$15:$F$29,2))))),IF(H9<1999,VLOOKUP(K9,Minimas!$G$15:$L$29,6),IF(AND(H9>1998,H9<2002),VLOOKUP(K9,Minimas!$G$15:$L$29,5),IF(AND(H9>2001,H9<2004),VLOOKUP(K9,Minimas!$G$15:$L$29,4),IF(AND(H9>2003,H9<2006),VLOOKUP(K9,Minimas!$G$15:$L$29,3),VLOOKUP(K9,Minimas!$G$15:$L$29,2)))))))","v":"U17 M96"},160.87920854936812,null,null,null,null,{"$f":"T9-HLOOKUP(V9,Minimas!$C$3:$CD$12,2,FALSE)","v":20},{"$f":"T9-HLOOKUP(V9,Minimas!$C$3:$CD$12,3,FALSE)","v":0},{"$f":"T9-HLOOKUP(V9,Minimas!$C$3:$CD$12,4,FALSE)","v":-25},{"$f":"T9-HLOOKUP(V9,Minimas!$C$3:$CD$12,5,FALSE)","v":-45},{"$f":"T9-HLOOKUP(V9,Minimas!$C$3:$CD$12,6,FALSE)","v":-65},{"$f":"T9-HLOOKUP(V9,Minimas!$C$3:$CD$12,7,FALSE)","v":-85},{"$f":"T9-HLOOKUP(V9,Minimas!$C$3:$CD$12,8,FALSE)","v":-110},{"$f":"T9-HLOOKUP(V9,Minimas!$C$3:$CD$12,9,FALSE)","v":-140},{"$f":"T9-HLOOKUP(V9,Minimas!$C$3:$CD$12,10,FALSE)","v":-220},"DPT +",null,"DPT +",0]
[null,null,null,null,null,null,null,null,null,null,null,null,null,null,null,null,null,null,null,null,null,null,null,null,null,null,null,"DEB ","DEP +","REG +","IRG +","FED +","NAT +","INTB +","INTA +","OLY +"]
{"$rows_left_out":29}
{"sheet":"cadette juniors filles ","index":1,"n_rows":38,"n_cols":40,"rows_kept":38,"cut":false,"hidden":false,"merged":[[33,16,33,19],[4,5,4,6],[1,13,1,18],[1,21,1,22],[2,13,2,18],[2,21,2,22],[1,3,2,8],[1,10,2,11],[26,3,28,3],[34,16,34,19],[33,20,33,22],[34,20,34,22],[30,1,37,11],[30,20,30,22],[31,20,31,22],[32,20,32,22],[37,20,37,22],[35,20,35,22],[36,20,36,22],[35,16,35,19],[36,16,36,19],[37,16,37,19],[30,16,30,19],[31,16,31,19],[32,16,32,19],[6,1,8,1],[6,3,8,3],[7,8,8,8],[10,1,12,1],[14,1,16,1],[26,1,28,1],[11,8,12,8],[15,8,16,8],[19,8,20,8],[23,8,24,8],[27,8,28,8],[18,1,20,1],[10,3,12,3],[14,3,16,3],[18,3,20,3],[22,3,24,3],[22,1,24,1]]}
[]
[null,null,null,"COUPE DE FRANCE U15 - U17 - U20 - H&F",null,null,null,null,null,null,"1er \nTour",null,null,"LIEU",null,null,null,null,null,null,null,"DATE"]
[null,null,null,"ELIMINATOIRES DE LIGUE GPF / FRANCE ",null,null,null,null,null,null,null,null,null,"BORDEAUX",null,null,null,null,null,null,null,"2019-01-15"]
[]
[null,"REG","Licence","Pl","Genre","NOM - Prénom",null,"AN","CLUB","NAT","P.C.",1,2,3,"ARR",1,2,3,"EP-J","TOTAL","Serie","Catégorie","IWF",null,null,null,null,"DEB","DPT +","REG +","IRG +","FED +","NAT +","INTB +","INTA +","OLY +"]
[null,null,null,null,null,null,null,null,null,null,null,null,null,null,null,null,null,null,null,null,null,null,null,null,null,null,null,"DEB ","DEP +","REG +","IRG +","FED +","NAT +","INTB +","INTA +","OLY +"]
[null,"SUD PACA",402800,null,"F","FALCOU","Cassandra",2000,"ASLDDTOULON1","F",46.8,50,53,55,{"$f":"IF(E7=\"\",\"\",IF(MAXA(L7:N7)<=0,0,MAXA(L7:N7)))","v":55},65,68,70,{"$f":"IF(E7=\"\",\"\",IF(MAXA(P7:R7)<=0,0,MAXA(P7:R7)))","v":70},{"$f":"IF(E7=\"\",\"\",O7+S7)","v":125},{"$f":"+CONCATENATE(AM7,\" \",AN7)","v":"INTB + 5"},{"$f":"IF(E7=0,\" \",IF(E7=\"H\",IF(H7<1999,VLOOKUP(K7,Minimas!$A$15:$F$29,6),IF(AND(H7>1998,H7<2002),VLOOKUP(K7,Minimas!$A$15:$F$29,5),IF(AND(H7>2001,H7<2004),VLOOKUP(K7,Minimas!$A$15:$F$29,4),IF(AND(H7>2003,H7<2006),VLOOKUP(K7,Minimas!$A$15:$F$29,3),VLOOKUP(K7,Minimas!$A$15:$F$29,2))))),IF(H7<1999,VLOOKUP(K7,Minimas!$G$15:$L$29,6),IF(AND(H7>1998,H7<2002),VLOOKUP(K7,Minimas!$G$15:$L$29,5),IF(AND(H7>2001,H7<2004),VLOOKUP(K7,Minimas!$G$15:$L$29,4),IF(AND(H7>2003,H7<2006),VLOOKUP(K7,Minimas!$G$15:$L$29,3),VLOOKUP(K7,Minimas!$G$15:$L$29,2)))))))","v":"U20 F49"},{"$f":"IF(E7=\" \",\" \",IF(E7=\"H\",10^(0.75194503*LOG(K7/175.508)^2)*T7,IF(E7=\"F\",10^(0.783497476* LOG(K7/153.655)^2)*T7,\"\")))","v":202.192127050783},null,null,null,null,{"$f":"T7-HLOOKUP(V7,Minimas!$C$3:$CD$12,2,FALSE)","v":80},{"$f":"T7-HLOOKUP(V7,Minimas!$C$3:$CD$12,3,FALSE)","v":70},{"$f":"T7-HLOOKUP(V7,Minimas!$C$3:$CD$12,4,FALSE)","v":60},{"$f":"T7-HLOOKUP(V7,Minimas!$C$3:$CD$12,5,FALSE)","v":48},{"$f":"T7-HLOOKUP(V7,Minimas!$C$3:$CD$12,6,FALSE)","v":35},{"$f":"T7-HLOOKUP(V7,Minimas!$C$3:$CD$12,7,FALSE)","v":20},{"$f":"T7-HLOOKUP(V7,Minimas!$C$3:$CD$12,8,FALSE)","v":5},{"$f":"T7-HLOOKUP(V7,Minimas!$C$3:$CD$12,9,FALSE)","v":-15},{"$f":"T7-HLOOKUP(V7,Minimas!$C$3:$CD$12,10,FALSE)","v":-50},{"$f":"IF(E7=0,\" \",IF(AJ7>=0,$AJ$5,IF(AI7>=0,$AI$5,IF(AH7>=0,$AH$5,IF(AG7>=0,$AG$5,IF(AF7>=0,$AF$5,IF(AE7>=0,$AE$5,IF(AD7>=0,$AD$5,IF(AC7>=0,$AC$5,$AB$5)))))))))","v":"INTB +"},null,{"$f":"IF(AK7=\"\",\"\",AK7)","v":"INTB +"},{"$f":"IF(E7=0,\" \",IF(AJ7>=0,AJ7,IF(AI7>=0,AI7,IF(AH7>=0,AH7,IF(AG7>=0,AG7,IF(AF7>=0,AF7,IF(AE7>=0,AE7,IF(AD7>=0,AD7,IF(AC7>=0,AC7,AB7)))))))))","v":5}]
[null,null,403855,null,"F","MAZOUZ","Elodie",2000,{"$f":"SUM(W7:W9)","v":558.94321021725796},"F",54.9,54,-57,57,{"$f":"IF(E8=\"\",\"\",IF(MAXA(L8:N8)<=0,0,MAXA(L8:N8)))","v":57},68,71,74,{"$f":"IF(E8=\"\",\"\",IF(MAXA(P8:R8)<=0,0,MAXA(P8:R8)))","v":74},{"$f":"IF(E8=\"\",\"\",O8+S8)","v":131},"NAT + 13",{"$f":"IF(E8=0,\" \",IF(E8=\"H\",IF(H8<1999,VLOOKUP(K8,Minimas!$A$15:$F$29,6),IF(AND(H8>1998,H8<2002),VLOOKUP(K8,Minimas!$A$15:$F$29,5),IF(AND(H8>2001,H8<2004),VLOOKUP(K8,Minimas!$A$15:$F$29,4),IF(AND(H8>2003,H8<2006),VLOOKUP(K8,Minimas!$A$15:$F$29,3),VLOOKUP(K8,Minimas!$A$15:$F$29,2))))),IF(H8<1999,VLOOKUP(K8,Minimas!$G$15:$L$29,6),IF(AND(H8>1998,H8<2002),VLOOKUP(K8,Minimas!$G$15:$L$29,5),IF(AND(H8>2001,H8<2004),VLOOKUP(K8,Minimas!$G$15:$L$29,4),IF(AND(H8>2003,H8<2006),VLOOKUP(K8,Minimas!$G$15:$L$29,3),VLOOKUP(K8,Minimas!$G$15:$L$29,2)))))))","v":"U20 F55"},{"$f":"IF(E8=\" \",\" \",IF(E8=\"H\",10^(0.75194503*LOG(K8/175.508)^2)*T8,IF(E8=\"F\",10^(0.783497476* LOG(K8/153.655)^2)*T8,\"\")))","v":187.84653073082652},null,null,null,null,{"$f":"T8-HLOOKUP(V8,Minimas!$C$3:$CD$12,2,FALSE)","v":81},{"$f":"T8-HLOOKUP(V8,Minimas!$C$3:$CD$12,3,FALSE)","v":69},{"$f":"T8-HLOOKUP(V8,Minimas!$C$3:$CD$12,4,FALSE)","v":56},{"$f":"T8-HLOOKUP(V8,Minimas!$C$3:$CD$12,5,FALSE)","v":44},{"$f":"T8-HLOOKUP(V8,Minimas!$C$3:$CD$12,6,FALSE)","v":28},{"$f":"T8-HLOOKUP(V8,Minimas!$C$3:$CD$12,7,FALSE)","v":13},{"$f":"T8-HLOOKUP(V8,Minimas!$C$3:$CD$12,8,FALSE)","v":-7},{"$f":"T8-HLOOKUP(V8,Minimas!$C$3:$CD$12,9,FALSE)","v":-29},{"$f":"T8-HLOOKUP(V8,Minimas!$C$3:$CD$12,10,FALSE)","v":-59},{"$f":"IF(E8=0,\" \",IF(AJ8>=0,$AJ$5,IF(AI8>=0,$AI$5,IF(AH8>=0,$AH$5,IF(AG8>=0,$AG$5,IF(AF8>=0,$AF$5,IF(AE8>=0,$AE$5,IF(AD8>=0,$AD$5,IF(AC8>=0,$AC$5,$AB$5)))))))))","v":"NAT +"},null,{"$f":"IF(AK8=\"\",\"\",AK8)","v":"NAT +"},{"$f":"IF(E8=0,\" \",IF(AJ8>=0,AJ8,IF(AI8>=0,AI8,IF(AH8>=0,AH8,IF(AG8>=0,AG8,IF(AF8>=0,AF8,IF(AE8>=0,AE8,IF(AD8>=0,AD8,IF(AC8>=0,AC8,AB8)))))))))","v":13}]
[null,null,397293,null,"F","MAILLOT","Bahia",2001,null,"F",62.3,57,60,-62,60,65,68,-70,68,128,"FED + 10",{"$f":"IF(E9=0,\" \",IF(E9=\"H\",IF(H9<1999,VLOOKUP(K9,Minimas!$A$15:$F$29,6),IF(AND(H9>1998,H9<2002),VLOOKUP(K9,Minimas!$A$15:$F$29,5),IF(AND(H9>2001,H9<2004),VLOOKUP(K9,Minimas!$A$15:$F$29,4),IF(AND(H9>2003,H9<2006),VLOOKUP(K9,Minimas!$A$15:$F$29,3),VLOOKUP(K9,Minimas!$A$15:$F$29,2))))),IF(H9<1999,VLOOKUP(K9,Minimas!$G$15:$L$29,6),IF(AND(H9>1998,H9<2002),VLOOKUP(K9,Minimas!$G$15:$L$29,5),IF(AND(H9>2001,H9<2004),VLOOKUP(K9,Minimas!$G$15:$L$29,4),IF(AND(H9>2003,H9<2006),VLOOKUP(K9,Minimas!$G$15:$L$29,3),VLOOKUP(K9,Minimas!$G$15:$L$29,2)))))))","v":"U20 F64"},168.90455243564838,null,null,null,null,{"$f":"T9-HLOOKUP(V9,Minimas!$C$3:$CD$12,2,FALSE)","v":68},{"$f":"T9-HLOOKUP(V9,Minimas!$C$3:$CD$12,3,FALSE)","v":53},{"$f":"T9-HLOOKUP(V9,Minimas!$C$3:$CD$12,4,FALSE)","v":38},{"$f":"T9-HLOOKUP(V9,Minimas!$C$3:$CD$12,5,FALSE)","v":23},{"$f":"T9-HLOOKUP(V9,Minimas!$C$3:$CD$12,6,FALSE)","v":10},{"$f":"T9-HLOOKUP(V9,Minimas!$C$3:$CD$12,7,FALSE)","v":-7},{"$f":"T9-HLOOKUP(V9,Minimas!$C$3:$CD$12,8,FALSE)","v":-27},{"$f":"T9-HLOOKUP(V9,Minimas!$C$3:$CD$12,9,FALSE)","v":-47},{"$f":"T9-HLOOKUP(V9,Minimas!$C$3:$CD$12,10,FALSE)","v":-82},"FED +",null,"FED +",10]
[null,null,null,null,null,null,null,null,null,null,null,null,null,null,null,null,null,null,null,null,null,null,null,null,null,null,null,"DEB ","DEP +","REG +","IRG +","FED +","NAT +","INTB +","INTA +","OLY +"]
{"$rows_left_out":29}
{"sheet":"Minimas","index":2,"n_rows":29,"n_cols":82,"rows_kept":29,"cut":false,"hidden":true,"merged":[]}
[]
[]
[null,null,"U15 F40","U15 F45","U15 F49","U15 F55","U15 F59","U15 F64","U15 F71","U15 F76","U15 F81","U15 F>81","U17 F40","U17 F45","U17 F49","U17 F55","U17 F59","U17 F64","U17 F71","U17 F76","U17 F81","U17 F>81","U20 F45","U20 F49","U20 F55","U20 F59","U20 F64","U20 F71","U20 F76","U20 F81","U20 F87","U20 F>87","SE F45","SE F49","SE F55","SE F59","SE F64","SE F71","SE F76","SE F81","SE F87","SE F>87","U15 M49","U15 M55","U15 M61","U15 M67","U15 M73","U15 M81","U15 M89","U15 M96","U15 M102","U15 M>102","U17 M49","U17 M55","U17 M61","U17 M67","U17 M73","U17 M81","U17 M89","U17 M96","U17 M102","U17 M>102","U20 M55","U20 M61","U20 M67","U20 M73","U20 M81","U20 M89","U20 M96","U20 M102","U20 M109","U20 M>109","SE M55","SE M61","SE M67","SE M73","SE M81","SE M89","SE M96","SE M102","SE M109","SE M>109"]
[null,"DEBUTANT",20,25,30,35,40,45,50,55,57,60,30,35,40,45,50,55,60,65,67,70,40,45,50,55,60,65,70,75,77,80,50,55,60,65,70,75,80,85,87,90,40,55,65,75,80,85,90,95,100,105,50,65,80,90,100,110,115,120,125,130,80,95,105,120,130,135,140,145,150,155,95,110,125,135,145,150,155,160,165,170]
[null,"DEPARTEMENTAL",25,35,40,45,50,55,60,65,67,70,35,42,50,55,60,65,70,75,77,80,50,55,62,70,75,80,85,90,92,95,60,67,75,80,85,90,95,100,102,105,55,70,80,95,100,105,110,115,120,125,65,85,100,110,120,130,135,140,145,150,100,115,125,140,150,160,165,170,175,180,115,130,145,160,170,175,180,185,190,195]
[null,"REGIONAL",35,45,50,57,62,67,72,75,77,80,45,50,57,65,70,75,80,85,90,95,60,65,75,82,90,95,100,105,107,110,70,80,87,92,100,107,115,120,122,125,70,85,100,110,120,130,135,140,145,150,80,100,120,130,140,150,160,165,170,175,115,130,150,160,170,180,185,190,195,200,130,150,170,185,195,200,205,210,215,220]
[null,"INTERREGIONAL",45,55,60,67,72,77,82,85,87,90,55,60,67,77,82,87,92,97,100,105,70,77,87,95,105,110,115,120,122,125,82,92,102,107,117,122,130,135,137,140,85,100,115,130,140,150,155,160,165,170,95,115,135,150,160,170,180,185,190,195,130,150,170,180,190,200,210,215,220,225,145,170,195,210,220,230,235,240,245,250]
[null,"FEDERAL",55,65,72,82,87,92,97,100,102,105,68,75,82,92,97,102,107,110,112,115,83,90,103,110,118,123,127,132,135,140,95,107,123,130,137,142,147,150,152,155,100,115,130,150,160,170,175,180,185,190,110,130,150,170,180,190,200,205,210,215,145,170,190,200,215,225,230,240,245,250,170,195,225,240,250,260,265,270,275,280]
[null,"NATIONAL",68,78,85,95,100,105,110,115,117,120,80,88,95,105,110,115,120,125,130,135,97,105,118,125,135,142,147,152,155,160,110,122,138,145,155,165,170,172,175,180,115,130,150,170,180,190,200,205,210,215,125,145,170,190,200,210,220,225,230,235,170,190,218,230,245,255,260,270,275,280,190,215,240,260,275,287,295,302,310,315]
[null,"INTERNATIONAL B",80,90,100,110,115,120,125,130,132,135,90,100,110,120,125,130,135,140,145,150,110,120,138,145,155,162,167,172,175,180,125,140,155,165,175,185,190,192,195,200,130,150,170,190,200,210,220,225,230,235,140,170,190,210,220,230,240,250,255,260,190,210,240,250,270,285,290,300,305,310,210,235,260,280,295,310,320,330,335,340]
{"$rows_left_out":19}